Target
Streptokinase A
Ligand
BDBM51899
Substrate
Meas. Tech.
Absorbance Microorganism-Based Dose Response HTS to Identify Inhibitors of Streptokinase Expression
EC50
150000±n/a nM
Citation
 PubChem, PC Absorbance Microorganism-Based Dose Response HTS to Identify Inhibitors of Streptokinase Expression PubChem Bioassay (2009)[AID] 
Target
Name:
Streptokinase A
Synonyms:
STRP_STRP1 streptokinase A precursor
Type:
Enzyme Catalytic Domain
Mol. Mass.:
49924.80
Organism:
Streptococcus pyogenes M1 GAS
Description:
gi_15675770
Residue:
440
  
Inhibitor
Name:
BDBM51899
Synonyms:
(2Z)-1-methyl-2-[(2Z)-2-[(1-methyl-2-benzo[e][1,3]benzothiazol-1-iumyl)methylidene]butylidene]benzo[e][1,3]benzothiazole;chloride 1-Methyl-2-[2-(1-methyl-1H-naphtho[1,2-d]thiazol-2-ylidenemethyl)-but-1-enyl]-naphtho[1,2-d]thiazol-1-ium MLS001205038 cid_23724230
Type:
Small organic molecule
Emp. Form.:
C29H25N2S2
Mol. Mass.:
465.652
SMILES:
CC\C(=C\c1sc2ccc3ccccc3c2[n+]1C)\C=C1/Sc2ccc3ccccc3c2N1C
: