Target
Streptokinase A
Ligand
BDBM58484
Substrate
Meas. Tech.
Absorbance Microorganism-Based Dose Response HTS to Identify Inhibitors of Streptokinase Expression
EC50
150000±n/a nM
Citation
 PubChem, PC Absorbance Microorganism-Based Dose Response HTS to Identify Inhibitors of Streptokinase Expression PubChem Bioassay (2009)[AID] 
Target
Name:
Streptokinase A
Synonyms:
STRP_STRP1 streptokinase A precursor
Type:
Enzyme Catalytic Domain
Mol. Mass.:
49924.80
Organism:
Streptococcus pyogenes M1 GAS
Description:
gi_15675770
Residue:
440
  
Inhibitor
Name:
BDBM58484
Synonyms:
3-(4-hydroxyphenyl)-N-(6-methoxy-3-pyridinyl)benzamide 3-(4-hydroxyphenyl)-N-(6-methoxypyridin-3-yl)benzamide SMR000591707 | cid_2463899
Type:
Small organic molecule
Emp. Form.:
C19H16N2O3
Mol. Mass.:
320.3419
SMILES:
COc1ccc(NC(=O)c2cccc(c2)-c2ccc(O)cc2)cn1
: