Target
Large T antigen
Ligand
BDBM58968
Substrate
Meas. Tech.
Identification of SV40 T antigen inhibitors: Cytotoxicity screen of selected hits
EC50
11090±n/a nM
Citation
 PubChem, PC Identification of SV40 T antigen inhibitors: Cytotoxicity screen of selected hits PubChem Bioassay (2009)[AID] 
Target
Name:
Large T antigen
Synonyms:
LT LT_SV40
Type:
Enzyme Catalytic Domain
Mol. Mass.:
81575.54
Organism:
Simian virus 40
Description:
P03070
Residue:
708
  
Inhibitor
Name:
BDBM58968
Synonyms:
(5Z)-5-(4-hydroxy-6-keto-3-propyl-cyclohexa-2,4-dien-1-ylidene)-4-thiazol-4-yl-3-pyrazoline-3-carboxylic acid ethyl ester MLS000565052 cid_5685345 ethyl (5Z)-5-(4-oxidanyl-6-oxidanylidene-3-propyl-cyclohexa-2,4-dien-1-ylidene)-4-(1,3-thiazol-4-yl)-1,2-dihydropyrazole-3-carboxylate
Type:
Small organic molecule
Emp. Form.:
C18H19N3O4S
Mol. Mass.:
373.426
SMILES:
CCCc1cc(-c2n[nH]c(C(=O)OCC)c2-c2cscn2)c(O)cc1O
: