Target
Large T antigen
Ligand
BDBM59006
Substrate
Meas. Tech.
Identification of SV40 T antigen inhibitors: Cytotoxicity screen of selected hits
EC50
21750±n/a nM
Citation
 PubChem, PC Identification of SV40 T antigen inhibitors: Cytotoxicity screen of selected hits PubChem Bioassay (2009)[AID] 
Target
Name:
Large T antigen
Synonyms:
LT LT_SV40
Type:
Enzyme Catalytic Domain
Mol. Mass.:
81575.54
Organism:
Simian virus 40
Description:
P03070
Residue:
708
  
Inhibitor
Name:
BDBM59006
Synonyms:
2-[(1E,3E,5E)-6-(dimethylamino)hexa-1,3,5-trienyl]-1,3,3-trimethyl-3H-indolium SMR000306051 dimethyl-[(2E,4E,6Z)-6-(1,3,3-trimethyl-2-indolylidene)hexa-2,4-dienylidene]ammonium;tetrafluoroborate dimethyl-[(2E,4E,6Z)-6-(1,3,3-trimethylindolin-2-ylidene)hexa-2,4-dienylidene]ammonium;tetrafluoroborate
Type:
Small organic molecule
Emp. Form.:
C19H25N2
Mol. Mass.:
281.4147
SMILES:
CN(C)\C=C\C=C\C=C\C1=[N+](C)c2ccccc2C1(C)C
: