Target
Large T antigen
Ligand
BDBM59038
Substrate
Meas. Tech.
Identification of SV40 T antigen inhibitors: Cytotoxicity screen of selected hits
EC50
20680±n/a nM
Citation
 PubChem, PC Identification of SV40 T antigen inhibitors: Cytotoxicity screen of selected hits PubChem Bioassay (2009)[AID] 
Target
Name:
Large T antigen
Synonyms:
LT LT_SV40
Type:
Enzyme Catalytic Domain
Mol. Mass.:
81575.54
Organism:
Simian virus 40
Description:
P03070
Residue:
708
  
Inhibitor
Name:
BDBM59038
Synonyms:
1-[4-(4-hydroxyphenyl)-1-piperazinyl]-3-(4-methylphenoxy)-1-propanone 1-[4-(4-hydroxyphenyl)piperazino]-3-(4-methylphenoxy)propan-1-one SMR000372731 | cid_2423189
Type:
Small organic molecule
Emp. Form.:
C20H24N2O3
Mol. Mass.:
340.4162
SMILES:
Cc1ccc(OCCC(=O)N2CCN(CC2)c2ccc(O)cc2)cc1
: