Target
Large T antigen
Ligand
BDBM59046
Substrate
Meas. Tech.
Identification of SV40 T antigen inhibitors: Cytotoxicity screen of selected hits
EC50
24540±n/a nM
Citation
 PubChem, PC Identification of SV40 T antigen inhibitors: Cytotoxicity screen of selected hits PubChem Bioassay (2009)[AID] 
Target
Name:
Large T antigen
Synonyms:
LT LT_SV40
Type:
Enzyme Catalytic Domain
Mol. Mass.:
81575.54
Organism:
Simian virus 40
Description:
P03070
Residue:
708
  
Inhibitor
Name:
BDBM59046
Synonyms:
MLS001179577 N-tert-butyl-2-[2-methoxy-4-[(4-piperidin-1-ylanilino)methyl]phenoxy]acetamide N-tert-butyl-2-[2-methoxy-4-[[(4-piperidin-1-ylphenyl)amino]methyl]phenoxy]ethanamide SMR000477196 | cid_1017359
Type:
Small organic molecule
Emp. Form.:
C25H35N3O3
Mol. Mass.:
425.5637
SMILES:
COc1cc(CNc2ccc(cc2)N2CCCCC2)ccc1OCC(=O)NC(C)(C)C
: