Target
Large T antigen
Ligand
BDBM59086
Substrate
Meas. Tech.
Identification of SV40 T antigen inhibitors: Cytotoxicity screen of selected hits
EC50
3490±n/a nM
Citation
 PubChem, PC Identification of SV40 T antigen inhibitors: Cytotoxicity screen of selected hits PubChem Bioassay (2009)[AID] 
Target
Name:
Large T antigen
Synonyms:
LT LT_SV40
Type:
Enzyme Catalytic Domain
Mol. Mass.:
81575.54
Organism:
Simian virus 40
Description:
P03070
Residue:
708
  
Inhibitor
Name:
BDBM59086
Synonyms:
1-[N'-[6-[[amino-[[N'-(2-ethylhexyl)amidino]amino]methylene]amino]hexyl]amidino]-2-(2-ethylhexyl)guanidine;hydrochloride 1-[N'-[6-[[azanyl-[[N'-(2-ethylhexyl)carbamimidoyl]amino]methylidene]amino]hexyl]carbamimidoyl]-2-(2-ethylhexyl)guanidine;hydrochloride Alexidine dihydrochloride SMR001233329 | cid_18968508
Type:
Small organic molecule
Emp. Form.:
C26H56N10
Mol. Mass.:
508.7898
SMILES:
CCCCC(CC)CN=C(N)NC(N)=NCCCCCCN=C(N)NC(N)=NCC(CC)CCCC
: