Target
Coagulation factor VIII
Ligand
BDBM59151
Substrate
Meas. Tech.
Inhibition Assay
Temperature
310.15±0 K
IC50
5.61e+4± 4.9e+3 nM
Citation
 Spiegel, PCKaiser, SMSimon, JAStoddard, BL Disruption of protein-membrane binding and identification of small-molecule inhibitors of coagulation factor VIII. Chem Biol 11:1413-22 (2004)  
Target
Name:
Coagulation factor VIII
Synonyms:
AHF F8 FA8_HUMAN Factor VIII B chain Factor VIIIa heavy chain, 92 kDa isoform Procoagulant component
Type:
Protein
Mol. Mass.:
267036.98
Organism:
Homo sapiens (Human)
Description:
P00451
Residue:
2351
  
Inhibitor
Name:
BDBM59151
Synonyms:
5247489
Type:
Small organic molecule
Emp. Form.:
C19H22N2O3
Mol. Mass.:
326.3896
SMILES:
CC(C=Cc1ccco1)=NCCCCNC(=O)C=Cc1ccco1
: