Target
Coagulation factor VIII
Ligand
BDBM59155
Substrate
Meas. Tech.
Inhibition Assay
Temperature
310.15±0 K
IC50
2.45e+4± 3.8e+3 nM
Citation
 Spiegel, PCKaiser, SMSimon, JAStoddard, BL Disruption of protein-membrane binding and identification of small-molecule inhibitors of coagulation factor VIII. Chem Biol 11:1413-22 (2004)  
Target
Name:
Coagulation factor VIII
Synonyms:
AHF F8 FA8_HUMAN Factor VIII B chain Factor VIIIa heavy chain, 92 kDa isoform Procoagulant component
Type:
Protein
Mol. Mass.:
267036.98
Organism:
Homo sapiens (Human)
Description:
P00451
Residue:
2351
  
Inhibitor
Name:
BDBM59155
Synonyms:
5924029
Type:
Small organic molecule
Emp. Form.:
C15H13F2N5
Mol. Mass.:
301.294
SMILES:
Fc1ccc(C=NNC(=N)NN=Cc2ccc(F)cc2)cc1
: