Target
Coagulation factor VIII
Ligand
BDBM59157
Substrate
Meas. Tech.
Inhibition Assay
Temperature
310.15±0 K
IC50
1.19e+4± 1.2e+3 nM
Citation
 Spiegel, PCKaiser, SMSimon, JAStoddard, BL Disruption of protein-membrane binding and identification of small-molecule inhibitors of coagulation factor VIII. Chem Biol 11:1413-22 (2004)  
Target
Name:
Coagulation factor VIII
Synonyms:
AHF F8 FA8_HUMAN Factor VIII B chain Factor VIIIa heavy chain, 92 kDa isoform Procoagulant component
Type:
Protein
Mol. Mass.:
267036.98
Organism:
Homo sapiens (Human)
Description:
P00451
Residue:
2351
  
Inhibitor
Name:
BDBM59157
Synonyms:
6126765
Type:
Small organic molecule
Emp. Form.:
C20H19N3O5S2
Mol. Mass.:
445.512
SMILES:
COc1cc(\C=C2\SC(=S)N(CC(=O)Nc3ccccn3)C2=O)cc(OC)c1OC
: