Target
Coagulation factor VIII
Ligand
BDBM59160
Substrate
Meas. Tech.
Inhibition Assay
Temperature
310.15±0 K
IC50
1.24e+4± 1.7e+3 nM
Citation
 Spiegel, PCKaiser, SMSimon, JAStoddard, BL Disruption of protein-membrane binding and identification of small-molecule inhibitors of coagulation factor VIII. Chem Biol 11:1413-22 (2004)  
Target
Name:
Coagulation factor VIII
Synonyms:
AHF F8 FA8_HUMAN Factor VIII B chain Factor VIIIa heavy chain, 92 kDa isoform Procoagulant component
Type:
Protein
Mol. Mass.:
267036.98
Organism:
Homo sapiens (Human)
Description:
P00451
Residue:
2351
  
Inhibitor
Name:
BDBM59160
Synonyms:
6209549
Type:
Small organic molecule
Emp. Form.:
C23H26N2O4S2
Mol. Mass.:
458.594
SMILES:
COc1cc(C=Nn2c(O)csc2=S)ccc1OCCOc1ccc(cc1)C(C)(C)C
: