Target
Coagulation factor VIII
Ligand
BDBM59162
Substrate
Meas. Tech.
Inhibition Assay
Temperature
310.15±0 K
IC50
2.44e+3± 2.9e+2 nM
Citation
 Spiegel, PCKaiser, SMSimon, JAStoddard, BL Disruption of protein-membrane binding and identification of small-molecule inhibitors of coagulation factor VIII. Chem Biol 11:1413-22 (2004)  
Target
Name:
Coagulation factor VIII
Synonyms:
AHF F8 FA8_HUMAN Factor VIII B chain Factor VIIIa heavy chain, 92 kDa isoform Procoagulant component
Type:
Protein
Mol. Mass.:
267036.98
Organism:
Homo sapiens (Human)
Description:
P00451
Residue:
2351
  
Inhibitor
Name:
BDBM59162
Synonyms:
8047577
Type:
Small organic molecule
Emp. Form.:
C21H10Cl2F3NO2S2
Mol. Mass.:
500.341
SMILES:
FC(F)(F)c1cccc(c1)N1C(=S)S\C(=C/c2ccc(o2)-c2ccc(Cl)cc2Cl)C1=O
: