Target
Coagulation factor VIII
Ligand
BDBM59164
Substrate
Meas. Tech.
Inhibition Assay
pH
8±0
IC50
3.89e+3± 2.9e+2 nM
Citation
 Spiegel, PCKaiser, SMSimon, JAStoddard, BL Disruption of protein-membrane binding and identification of small-molecule inhibitors of coagulation factor VIII. Chem Biol 11:1413-22 (2004)  
Target
Name:
Coagulation factor VIII
Synonyms:
AHF F8 FA8_HUMAN Factor VIII B chain Factor VIIIa heavy chain, 92 kDa isoform Procoagulant component
Type:
Protein
Mol. Mass.:
267036.98
Organism:
Homo sapiens (Human)
Description:
P00451
Residue:
2351
  
Inhibitor
Name:
BDBM59164
Synonyms:
8048422
Type:
Small organic molecule
Emp. Form.:
C16H8ClN2O5S
Mol. Mass.:
375.764
SMILES:
[#8-]-[#6](=O)-c1cc(ccc1Cl)-c1ccc(\[#6]=[#6]-2/[#6](=O)-[#7]-[#6](=S)-[#7]-[#6]-2=O)o1
: