Target
Adenosine receptor A3
Ligand
BDBM59209
Substrate
Meas. Tech.
Binding Assay
Ki
>10000±0 nM
Citation
 Jacobson, KAOhno, MDuong, HTKim, SKTchilibon, SCesnek, MHolý, AGao, ZG A neoceptor approach to unraveling microscopic interactions between the human A2A adenosine receptor and its agonists. Chem Biol 12:237-47 (2005)  
Target
Name:
Adenosine receptor A3
Synonyms:
A3 adenosine receptor (hA3) ADORA3 | Adenosine A3 receptor (A3AR)
Type:
G Protein-Coupled Receptor (GPCR)
Mol. Mass.:
36197.32
Organism:
Homo sapiens (Human)
Description:
P0DMS8
Residue:
318
  
Inhibitor
Name:
BDBM59209
Synonyms:
Adenosine analog, 14
Type:
Small organic molecule
Emp. Form.:
C20H25N7O4
Mol. Mass.:
427.457
SMILES:
Cc1ccccc1CNc1ncnc2n(cnc12)[C@@H]1O[C@@H]([C@@H](O)[C@H]1O)C(=O)NCCN
: