Target
Tubulin polymerization-promoting protein
Ligand
BDBM50005480
Substrate
Meas. Tech.
Cell Proliferation Assay
IC50
32±21 nM
Citation
 Kong, YGrembecka, JEdler, MCHamel, EMooberry, SLSabat, MRieger, JBrown, ML Structure-based discovery of a boronic acid bioisostere of combretastatin A-4. Chem Biol 12:1007-14 (2005)  
Target
Name:
Tubulin polymerization-promoting protein
Synonyms:
TPPP TPPP_HUMAN Tubulin polymerization-promoting protein
Type:
Protein
Mol. Mass.:
23706.03
Organism:
Homo sapiens (Human)
Description:
O94811
Residue:
219
  
Inhibitor
Name:
BDBM50005480
Synonyms:
(-)-combretastatin (Z)-5-(3,4,5-trimethoxystyryl)-2-methoxyphenol (combretastin A-4)2-Methoxy-5-[2-(3,4,5-trimethoxy-phenyl)-vinyl]-phenol 2-Methoxy-5-[(Z)-2-(3,4,5-trimethoxy-phenyl)-vinyl]-phenol 2-methoxy-5-(3,4,5-trimethoxystyryl)phenol 5-(3,4,5-trimethoxystyryl)-2-methoxyphenol CHEMBL67 Combrestatin A4 Combretastatin Combretastin A-4 combretastatin A-4, (CSA4) | combretastin A4
Type:
Small organic molecule
Emp. Form.:
C18H20O5
Mol. Mass.:
316.3484
SMILES:
COc1ccc(\C=C/c2cc(OC)c(OC)c(OC)c2)cc1O
: