Target
Cyclin-dependent kinase 2
Ligand
BDBM8061
Substrate
Meas. Tech.
In Vitro Inhibition
IC50
1e+1±n/a nM
Citation
 Kontopidis, GMcInnes, CPandalaneni, SRMcNae, IGibson, DMezna, MThomas, MWood, GWang, SWalkinshaw, MDFischer, PM Differential binding of inhibitors to active and inactive CDK2 provides insights for drug design. Chem Biol 13:201-11 (2006)  
Target
Name:
Cyclin-dependent kinase 2
Synonyms:
CDK2 CDK2_HUMAN Cell division protein kinase 2 Protein cereblon/Cyclin-dependent kinase 2 | p33 protein kinase
Type:
Enzyme Subunit
Mol. Mass.:
33938.17
Organism:
Homo sapiens (Human)
Description:
P24941
Residue:
298
  
Inhibitor
Name:
BDBM8061
Synonyms:
2-Anilino-4-(thiazol-5-yl)pyrimidine deriv. 32 4-methyl-5-{2-[(3-nitrophenyl)amino]pyrimidin-4-yl}-1,3-thiazol-2-amine [4-(2-Amino-4-methylthiazol-5-yl)pyrimidin-2-yl](3-nitrophenyl)amine
Type:
Small organic molecule
Emp. Form.:
C14H12N6O2S
Mol. Mass.:
328.349
SMILES:
Cc1nc(N)sc1-c1ccnc(Nc2cccc(c2)N(=O)=O)n1
: