Target
Alkaline phosphatase, tissue-nonspecific isozyme
Ligand
BDBM39736
Substrate
Meas. Tech.
uHTS identification of compounds activating TNAP in the absence of phosphate acceptor performed in luminescent assay
EC50
195±n/a nM
Citation
 PubChem, PC uHTS identification of compounds activating TNAP in the absence of phosphate acceptor performed in luminescent assay PubChem Bioassay (2009)[AID] 
Target
Name:
Alkaline phosphatase, tissue-nonspecific isozyme
Synonyms:
ALPL tissue-nonspecific alkaline phosphatase precursor
Type:
PROTEIN
Mol. Mass.:
57306.17
Organism:
Homo sapiens (Human)
Description:
ChEMBL_1448917
Residue:
524
  
Inhibitor
Name:
BDBM39736
Synonyms:
1'-butyl-2'-spiro[1,2-dihydro-4,1,2-benzoxadiazine-3,3'-indole]one 1'-butylspiro[1,2-dihydro-4,1,2-benzoxadiazine-3,3'-indoline]-2'-one SMR000152508 | cid_4588070
Type:
Small organic molecule
Emp. Form.:
C18H19N3O2
Mol. Mass.:
309.3624
SMILES:
CCCCN1C(=O)C2(NNc3ccccc3O2)c2ccccc12
: