Target
M17 leucyl aminopeptidase
Ligand
BDBM40645
Substrate
Meas. Tech.
Inhibitors of Plasmodium falciparum M17- Family Leucine Aminopeptidase (M17LAP)
IC50
7510±n/a nM
Citation
 PubChem, PC Inhibitors of Plasmodium falciparum M17- Family Leucine Aminopeptidase (M17LAP) PubChem Bioassay (2009)[AID] 
Target
Name:
M17 leucyl aminopeptidase
Synonyms:
leucine aminopeptidase
Type:
Enzyme Catalytic Domain
Mol. Mass.:
67834.32
Organism:
Plasmodium falciparum 3D7
Description:
gi_124809582
Residue:
605
  
Inhibitor
Name:
BDBM40645
Synonyms:
3-[[2-[(4-keto-6-methyl-1H-pyrimidin-2-yl)thio]acetyl]amino]benzoic acid methyl ester MLS000088247 cid_889959 methyl 3-[2-[(6-methyl-4-oxidanylidene-1H-pyrimidin-2-yl)sulfanyl]ethanoylamino]benzoate | methyl 3-[[2-[(6-methyl-4-oxo-1H-pyrimidin-2-yl)sulfanyl]acetyl]amino]benzoate
Type:
Small organic molecule
Emp. Form.:
C15H15N3O4S
Mol. Mass.:
333.362
SMILES:
COC(=O)c1cccc(NC(=O)CSc2nc(C)cc(=O)[nH]2)c1
: