Target
Large T antigen
Ligand
BDBM36908
Substrate
Meas. Tech.
Identification of SV40 T antigen inhibitors: A route to novel anti-viral reagents
IC50
10320±n/a nM
Citation
 PubChem, PC Identification of SV40 T antigen inhibitors: A route to novel anti-viral reagents PubChem Bioassay (2010)[AID] 
Target
Name:
Large T antigen
Synonyms:
LT LT_SV40
Type:
Enzyme Catalytic Domain
Mol. Mass.:
81575.54
Organism:
Simian virus 40
Description:
P03070
Residue:
708
  
Inhibitor
Name:
BDBM36908
Synonyms:
2-methoxy-4-(5-piperidin-1-ylpenta-1,3-diynyl)phenol;hydrochloride 2-methoxy-4-[5-(1-piperidinyl)penta-1,3-diynyl]phenol;hydrochloride SMR000057989 | cid_2852203
Type:
Small organic molecule
Emp. Form.:
C17H19NO2
Mol. Mass.:
269.3383
SMILES:
COc1cc(ccc1O)C#CC#CCN1CCCCC1
: