Target
Large T antigen
Ligand
BDBM39248
Substrate
Meas. Tech.
Identification of SV40 T antigen inhibitors: A route to novel anti-viral reagents
IC50
10370±n/a nM
Citation
 PubChem, PC Identification of SV40 T antigen inhibitors: A route to novel anti-viral reagents PubChem Bioassay (2010)[AID] 
Target
Name:
Large T antigen
Synonyms:
LT LT_SV40
Type:
Enzyme Catalytic Domain
Mol. Mass.:
81575.54
Organism:
Simian virus 40
Description:
P03070
Residue:
708
  
Inhibitor
Name:
BDBM39248
Synonyms:
5-(4-keto-8-methoxy-2-thioxo-1,5-dihydropyrimid[5,4-b]indol-3-yl)-N-(2-pyrrolidinoethyl)valeramide 5-(8-methoxy-4-oxo-2-sulfanylidene-1,5-dihydropyrimido[5,4-b]indol-3-yl)-N-(2-pyrrolidin-1-ylethyl)pentanamide 5-(8-methoxy-4-oxo-2-thioxo-1,2,4,5-tetrahydro-3H-pyrimido[5,4-b]indol-3-yl)-N-(2-pyrrolidin-1-ylethyl)pentanamide SMR000028553 | cid_3244338
Type:
Small organic molecule
Emp. Form.:
C22H29N5O3S
Mol. Mass.:
443.562
SMILES:
COc1ccc2[nH]c3c([nH]c(=S)n(CCCCC(=O)NCCN4CCCC4)c3=O)c2c1
: