Target
Large T antigen
Ligand
BDBM60381
Substrate
Meas. Tech.
Identification of SV40 T antigen inhibitors: A route to novel anti-viral reagents
IC50
5530±n/a nM
Citation
 PubChem, PC Identification of SV40 T antigen inhibitors: A route to novel anti-viral reagents PubChem Bioassay (2010)[AID] 
Target
Name:
Large T antigen
Synonyms:
LT LT_SV40
Type:
Enzyme Catalytic Domain
Mol. Mass.:
81575.54
Organism:
Simian virus 40
Description:
P03070
Residue:
708
  
Inhibitor
Name:
BDBM60381
Synonyms:
2-[(4-hydroxyanilino)methylene]-5,5-dimethyl-cyclohexane-1,3-quinone 2-[[(4-hydroxyphenyl)amino]methylidene]-5,5-dimethyl-cyclohexane-1,3-dione MLS000090104 cid_3245658
Type:
Small organic molecule
Emp. Form.:
C15H17NO3
Mol. Mass.:
259.3004
SMILES:
[#6]C1([#6])[#6]-[#6](=O)\[#6](=[#6]\[#7]-c2ccc(-[#8])cc2)-[#6](=O)-[#6]1
: