Target
Large T antigen
Ligand
BDBM39017
Substrate
Meas. Tech.
Identification of SV40 T antigen inhibitors: A route to novel anti-viral reagents
IC50
5190±n/a nM
Citation
 PubChem, PC Identification of SV40 T antigen inhibitors: A route to novel anti-viral reagents PubChem Bioassay (2010)[AID] 
Target
Name:
Large T antigen
Synonyms:
LT LT_SV40
Type:
Enzyme Catalytic Domain
Mol. Mass.:
81575.54
Organism:
Simian virus 40
Description:
P03070
Residue:
708
  
Inhibitor
Name:
BDBM39017
Synonyms:
(E)-3-[4-(dimethylamino)anilino]-1-phenyl-2-propen-1-one (E)-3-[4-(dimethylamino)anilino]-1-phenylprop-2-en-1-one 3-{[4-(dimethylamino)phenyl]amino}-1-phenyl-2-propen-1-one SMR000072535 | cid_2188632
Type:
Small organic molecule
Emp. Form.:
C17H18N2O
Mol. Mass.:
266.3376
SMILES:
CN(C)c1ccc(cc1)N=CCC(=O)c1ccccc1
: