Target
Large T antigen
Ligand
BDBM58960
Substrate
Meas. Tech.
Identification of SV40 T antigen inhibitors: A route to novel anti-viral reagents
IC50
5050±n/a nM
Citation
 PubChem, PC Identification of SV40 T antigen inhibitors: A route to novel anti-viral reagents PubChem Bioassay (2010)[AID] 
Target
Name:
Large T antigen
Synonyms:
LT LT_SV40
Type:
Enzyme Catalytic Domain
Mol. Mass.:
81575.54
Organism:
Simian virus 40
Description:
P03070
Residue:
708
  
Inhibitor
Name:
BDBM58960
Synonyms:
(4E)-2-methoxy-4-(3-phenylimino-1,7-dihydroimidazo[1,2-a]pyrazin-2-ylidene)-1-cyclohexa-2,5-dienone MLS000116164 cid_6324566
Type:
Small organic molecule
Emp. Form.:
C19H16N4O2
Mol. Mass.:
332.3559
SMILES:
COc1cc(ccc1O)-c1nc2c[nH]ccn2c1=Nc1ccccc1
: