Target
Neuropeptide Y receptor type 1
Ligand
BDBM58038
Substrate
Meas. Tech.
Fluorescence-based dose response cell-based high-throughput screening assay for potentiators or agonists of NPY-Y1.
EC50
10072±n/a nM
Citation
 PubChem, PC Fluorescence-based dose response cell-based high-throughput screening assay for potentiators or agonists of NPY-Y1. PubChem Bioassay (2009)[AID] 
Target
Name:
Neuropeptide Y receptor type 1
Synonyms:
NPY-Y1 NPY1R NPYR neuropeptide Y receptor Y1
Type:
Enzyme Catalytic Domain
Mol. Mass.:
44399.07
Organism:
Homo sapiens (Human)
Description:
NPY-Y1 NPY1R HUMAN::P25929
Residue:
384
  
Inhibitor
Name:
BDBM58038
Synonyms:
2-(3-Bromo-phenyl)-3-(4-chloro-phenyl)-1H-imidazo[4,5-b]quinoxaline MLS001012274 cid_5604367
Type:
Small organic molecule
Emp. Form.:
C21H13BrClN4
Mol. Mass.:
436.711
SMILES:
Clc1ccc(cc1)-[n+]1c([nH]c2nc3ccccc3nc12)-c1cccc(Br)c1
: