Target
Neuropeptide Y receptor type 1
Ligand
BDBM57123
Substrate
Meas. Tech.
Fluorescence-based counterscreen for agonists of NPY-Y2: cell-based high-throughput dose response assay for agonists of NPY-Y1.
EC50
12619±n/a nM
Citation
 PubChem, PC Fluorescence-based counterscreen for agonists of NPY-Y2: cell-based high-throughput dose response assay for agonists of NPY-Y1. PubChem Bioassay (2009)[AID] 
Target
Name:
Neuropeptide Y receptor type 1
Synonyms:
NPY-Y1 NPY1R NPYR neuropeptide Y receptor Y1
Type:
Enzyme Catalytic Domain
Mol. Mass.:
44399.07
Organism:
Homo sapiens (Human)
Description:
NPY-Y1 NPY1R HUMAN::P25929
Residue:
384
  
Inhibitor
Name:
BDBM57123
Synonyms:
MLS000533426 N-(3-chloroanilino)-N'-(2,4-dichlorophenyl)-2-keto-propionamidine N-[(3-chlorophenyl)amino]-N'-(2,4-dichlorophenyl)-2-oxidanylidene-propanimidamide cid_1799038
Type:
Small organic molecule
Emp. Form.:
C15H12Cl3N3O
Mol. Mass.:
356.634
SMILES:
CC(=O)C(Nc1ccc(Cl)cc1Cl)=NNc1cccc(Cl)c1
: