Target
Neuropeptide Y receptor type 1
Ligand
BDBM48679
Substrate
Meas. Tech.
Fluorescence-based counterscreen for agonists of NPY-Y2: cell-based high-throughput dose response assay for agonists of NPY-Y1.
EC50
9377±n/a nM
Citation
 PubChem, PC Fluorescence-based counterscreen for agonists of NPY-Y2: cell-based high-throughput dose response assay for agonists of NPY-Y1. PubChem Bioassay (2009)[AID] 
Target
Name:
Neuropeptide Y receptor type 1
Synonyms:
NPY-Y1 NPY1R NPYR neuropeptide Y receptor Y1
Type:
Enzyme Catalytic Domain
Mol. Mass.:
44399.07
Organism:
Homo sapiens (Human)
Description:
NPY-Y1 NPY1R HUMAN::P25929
Residue:
384
  
Inhibitor
Name:
BDBM48679
Synonyms:
2-[(4-chlorophenyl)hydrazinylidene]-3-oxidanylidene-3-phenyl-propanenitrile 2-[(4-chlorophenyl)hydrazono]-3-keto-3-phenyl-propionitrile MLS000545160 SMR000163064 | cid_830566
Type:
Small organic molecule
Emp. Form.:
C15H10ClN3O
Mol. Mass.:
283.712
SMILES:
Clc1ccc(NN=C(C#N)C(=O)c2ccccc2)cc1
: