Target
Neuropeptide Y receptor type 1
Ligand
BDBM61825
Substrate
Meas. Tech.
Fluorescence-based counterscreen for agonists of NPY-Y2: cell-based high-throughput dose response assay for agonists of NPY-Y1.
EC50
3408±n/a nM
Citation
 PubChem, PC Fluorescence-based counterscreen for agonists of NPY-Y2: cell-based high-throughput dose response assay for agonists of NPY-Y1. PubChem Bioassay (2009)[AID] 
Target
Name:
Neuropeptide Y receptor type 1
Synonyms:
NPY-Y1 NPY1R NPYR neuropeptide Y receptor Y1
Type:
Enzyme Catalytic Domain
Mol. Mass.:
44399.07
Organism:
Homo sapiens (Human)
Description:
NPY-Y1 NPY1R HUMAN::P25929
Residue:
384
  
Inhibitor
Name:
BDBM61825
Synonyms:
2-chloranyl-5-nitro-benzoic acid;5-methyl-1,2,3,4-tetrahydroacridin-9-amine 2-chloro-5-nitrobenzoic acid;5-methyl-1,2,3,4-tetrahydroacridin-9-amine SMR000282060 | cid_16192803
Type:
Small organic molecule
Emp. Form.:
C14H16N2
Mol. Mass.:
212.2902
SMILES:
Cc1cccc2c(N)c3CCCCc3nc12
: