Target
Induced myeloid leukemia cell differentiation protein Mcl-1
Ligand
BDBM31755
Substrate
Meas. Tech.
Fluorescence polarization-based biochemical high throughput dose response assay for inhibitors of myeloid cell leukemia sequence 1 (MCL1) interactions with BIM-BH3 peptide.
IC50
2916±n/a nM
Citation
 PubChem, PC Fluorescence polarization-based biochemical high throughput dose response assay for inhibitors of myeloid cell leukemia sequence 1 (MCL1) interactions with BIM-BH3 peptide. PubChem Bioassay (2009)[AID] 
Target
Name:
Induced myeloid leukemia cell differentiation protein Mcl-1
Synonyms:
BCL2L3 Bcl-2-like protein 3 (Mcl-1) Bcl2-L-3 MCL1 Mcl-1 Myeloid cell leukemia sequence 1 (BCL2-related) | mcl1/EAT
Type:
Membrane; Single-pass membrane protein
Mol. Mass.:
37332.87
Organism:
Homo sapiens (Human)
Description:
Q07820
Residue:
350
  
Inhibitor
Name:
BDBM31755
Synonyms:
3-(benzylthio)-5,6-bis(2-furyl)-1,2,4-triazine 5,6-bis(2-furanyl)-3-(phenylmethylthio)-1,2,4-triazine MLS-0029114.0001 | cid_2940938
Type:
Small organic molecule
Emp. Form.:
C18H13N3O2S
Mol. Mass.:
335.38
SMILES:
C(Sc1nnc(-c2ccco2)c(n1)-c1ccco1)c1ccccc1
: