Target
Gag-Pol polyprotein [588-1127,L687I]/[588-1147,L687I]
Ligand
BDBM1434
Substrate
poly(rC)-oligo(dG)(12-18)
Meas. Tech.
HIV RT Assay
pH
7.8±n/a
Temperature
310.15±n/a K
IC50
3500±180 nM
Citation
 Artico, MSilvestri, RMassa, SLoi, AGCorrias, SPiras, GLa Colla, P 2-Sulfonyl-4-chloroanilino moiety: a potent pharmacophore for the anti-human immunodeficiency virus type 1 activity of pyrrolyl aryl sulfones. J Med Chem 39:522-30 (1996)  
Target
Name:
Gag-Pol polyprotein [588-1127,L687I]/[588-1147,L687I]
Synonyms:
EC: 2.7.7.49 | HIV-1 Reverse Transcriptase Mutant (L100I)
Type:
Protein Complex
Mol. Mass.:
Description:
Components:
This complex has 2 components.
Component 1
Name:
Gag-Pol polyprotein [588-1147,L687I]
Synonyms:
HIV-1 Reverse Transcriptase Mutant (L100I) Chain A gag-pol
Type:
Enzyme Subunit
Mol. Mass.:
64486.41
Organism:
Human immunodeficiency virus type 1
Description:
P04585[588-1147,L687I]
Residue:
560
  
Component 2
Name:
Gag-Pol polyprotein [588-1127,L687I]
Synonyms:
HIV-1 Reverse Transcriptase Mutant (L100I) Chain B gag-pol
Type:
Enzyme Subunit
Mol. Mass.:
51337.13
Organism:
Human immunodeficiency virus type 1
Description:
P04585[588-1127,L687I]
Residue:
440
  
Inhibitor
Name:
BDBM1434
Synonyms:
11-cyclopropyl-5,11-dihydro-4-methyl-6H-dipyrido[3,2-b:2 ,3 -e][1,4]diazepin-6-one BI-RG-587 Nevirapine US11420959, Example NVP | Viramune
Type:
Small organic molecule
Emp. Form.:
C15H14N4O
Mol. Mass.:
266.2979
SMILES:
Cc1ccnc2N(C3CC3)c3ncccc3C(=O)Nc12
:
Substrate
Name:
poly(rC)-oligo(dG)(12-18)
Synonyms:
Type:
RNA/DNA duplex
Mol. Mass.:
358.43
Organism:
Description:
The incorporation of Tritium-labeled dGTP onto a poly(rC)-oligo(dG)(12-18) template-primer
Residue:
3
NA