Target
Regulator of G-protein signaling 16
Ligand
BDBM33145
Substrate
Meas. Tech.
Dose response, multiplexed high-throughput screen for small molecule regulators of RGS family protein interactions, specifically RGS16-Galphao for SAR Compounds
Ki
480±n/a nM
Citation
 PubChem, PC Dose response, multiplexed high-throughput screen for small molecule regulators of RGS family protein interactions, specifically RGS16-Galphao for SAR Compounds PubChem Bioassay (2010)[AID] 
Target
Name:
Regulator of G-protein signaling 16
Synonyms:
RGS16 RGSR regulator of G-protein signalling 16
Type:
Enzyme Catalytic Domain
Mol. Mass.:
22748.87
Organism:
Homo sapiens (Human)
Description:
gi_156416009
Residue:
202
  
Inhibitor
Name:
BDBM33145
Synonyms:
3-[[[(E)-(2,3-dihydroxy-4-keto-cyclohexa-2,5-dien-1-ylidene)methyl]amino]carbamoyl]-N,N-diethyl-benzenesulfonamide 3-[[[(E)-(2,3-dihydroxy-4-oxocyclohexa-2,5-dien-1-ylidene)methyl]amino]carbamoyl]-N,N-diethylbenzenesulfonamide 3-[[[(Z)-(2,3-dihydroxy-4-keto-cyclohexa-2,5-dien-1-ylidene)methyl]amino]carbamoyl]-N,N-diethyl-benzenesulfonamide SMR000244048 | cid_6263555
Type:
Small organic molecule
Emp. Form.:
C18H21N3O6S
Mol. Mass.:
407.441
SMILES:
CCN(CC)S(=O)(=O)c1cccc(c1)C(=O)NN=Cc1ccc(O)c(O)c1O
: