Target
Heat shock factor protein 1
Ligand
BDBM39020
Substrate
Meas. Tech.
Luminescence Cell-Based Dose Confimation HTS to Identify Inhibitors of Heat Shock Factor 1 (HSF1)
EC50
6562±1121 nM
Citation
 PubChem, PC Luminescence Cell-Based Dose Confimation HTS to Identify Inhibitors of Heat Shock Factor 1 (HSF1) PubChem Bioassay (2010)[AID] 
Target
Name:
Heat shock factor protein 1
Synonyms:
HSF1_MOUSE Hsf1 protein
Type:
Enzyme Catalytic Domain
Mol. Mass.:
57208.68
Organism:
Mus musculus
Description:
P38532
Residue:
525
  
Inhibitor
Name:
BDBM39020
Synonyms:
3-[(4,5-dimethyl-2-furoyl)amino]benzoic acid 3-[(4,5-dimethylfuran-2-yl)carbonylamino]benzoic acid MLS000062053 cid_781047
Type:
Small organic molecule
Emp. Form.:
C14H13NO4
Mol. Mass.:
259.2573
SMILES:
Cc1cc(oc1C)C(=O)Nc1cccc(c1)C(O)=O
: