Target
Mu-type opioid receptor
Ligand
BDBM50361
Substrate
Meas. Tech.
Fluorescence-based biochemical high throughput dose response assay to identify inhibitors of Protein Phosphatase 1 (PP1)
IC50
5109±n/a nM
Citation
 PubChem, PC Fluorescence-based biochemical high throughput dose response assay to identify inhibitors of Protein Phosphatase 1 (PP1) PubChem Bioassay (2010)[AID] 
Target
Name:
Mu-type opioid receptor
Synonyms:
M-OR-1 MOR-1 MUOR1 Mu opiate receptor OPRM1 hMOP | mu-type opioid receptor isoform MOR-1
Type:
G Protein-Coupled Receptor (GPCR)
Mol. Mass.:
44789.51
Organism:
Homo sapiens (Human)
Description:
P35372
Residue:
400
  
Inhibitor
Name:
BDBM50361
Synonyms:
MLS000393129 cid_2545431
Type:
Small organic molecule
Emp. Form.:
C23H17FN2O7S2
Mol. Mass.:
516.519
SMILES:
CCOC(=O)c1sc2nc3c(SCC(O)=O)cc(cn3c(=O)c2c1C)C(=O)c1cc(F)ccc1O
: