Target
Trans-activator protein BZLF1
Ligand
BDBM48816
Substrate
Meas. Tech.
Counterscreen for inhibitors of PP1: fluorescence-based biochemical high throughput dose response assay to identify inhibitors of Protein Phosphatase 5 (PP5)
IC50
>67047±n/a nM
Citation
 PubChem, PC Counterscreen for inhibitors of PP1: fluorescence-based biochemical high throughput dose response assay to identify inhibitors of Protein Phosphatase 5 (PP5) PubChem Bioassay (2010)[AID] 
Target
Name:
Trans-activator protein BZLF1
Synonyms:
BZLF1 PPP5C protein
Type:
Enzyme Catalytic Domain
Mol. Mass.:
26856.37
Organism:
Human herpesvirus 4
Description:
gi_82503229
Residue:
245
  
Inhibitor
Name:
BDBM48816
Synonyms:
MLS000334839 N-[5-[(4-cyanophenyl)methylsulfanyl]-1,3,4-thiadiazol-2-yl]-1,3-benzothiazole-6-carboxamide SMR000249597 | cid_2452051
Type:
Small organic molecule
Emp. Form.:
C18H11N5OS3
Mol. Mass.:
409.508
SMILES:
O=C(Nc1nnc(SCc2ccc(cc2)C#N)s1)c1ccc2ncsc2c1
: