Target
Trans-activator protein BZLF1
Ligand
BDBM50090503
Substrate
Meas. Tech.
Counterscreen for inhibitors of PP1: fluorescence-based biochemical high throughput dose response assay to identify inhibitors of Protein Phosphatase 5 (PP5)
IC50
2567±n/a nM
Citation
 PubChem, PC Counterscreen for inhibitors of PP1: fluorescence-based biochemical high throughput dose response assay to identify inhibitors of Protein Phosphatase 5 (PP5) PubChem Bioassay (2010)[AID] 
Target
Name:
Trans-activator protein BZLF1
Synonyms:
BZLF1 PPP5C protein
Type:
Enzyme Catalytic Domain
Mol. Mass.:
26856.37
Organism:
Human herpesvirus 4
Description:
gi_82503229
Residue:
245
  
Inhibitor
Name:
BDBM50090503
Synonyms:
(1R,2S,6R,7S)-4,10-Dioxa-tricyclo[5.2.1.0*2,6*]decane-3,5-dione CHEMBL298246 cid_6852411 | cid_93004
Type:
Small organic molecule
Emp. Form.:
C8H8O4
Mol. Mass.:
168.1467
SMILES:
O=C1OC(=O)[C@@H]2[C@H]3CC[C@H](O3)[C@H]12
: