Target
Tumor necrosis factor
Ligand
BDBM54427
Substrate
Meas. Tech.
HTS dose response assay for identification of inhibitors of TNFa-specific NF-kB induction
IC50
2382.5±229.5 nM
Citation
 PubChem, PC HTS dose response assay for identification of inhibitors of TNFa-specific NF-kB induction PubChem Bioassay (2010)[AID] 
Target
Name:
Tumor necrosis factor
Synonyms:
Cachectin TNF-a TNFA TNFSF2 Tumor necrosis factor (TNFa) Tumor necrosis factor ligand superfamily member 2 Tumor necrosis factor, soluble form | tumor necrosis factor alpha
Type:
Enzyme
Mol. Mass.:
25645.11
Organism:
Homo sapiens (Human)
Description:
P01375
Residue:
233
  
Inhibitor
Name:
BDBM54427
Synonyms:
2-(benzenesulfonyl)-3-nitropyridine 3-nitro-2-(phenylsulfonyl)pyridine SMR000550054 | cid_371687
Type:
Small organic molecule
Emp. Form.:
C11H8N2O4S
Mol. Mass.:
264.257
SMILES:
[O-][N+](=O)c1cccnc1S(=O)(=O)c1ccccc1
: