Target
60S ribosomal protein L19-A
Ligand
BDBM65992
Substrate
Meas. Tech.
Dose Response of TOR pathway GFP-fusion proteins in Saccharomyes cerevisiae specifically RPL19A based on MLPCN hits
EC50
4952±n/a nM
Citation
 PubChem, PC Dose Response of TOR pathway GFP-fusion proteins in Saccharomyes cerevisiae specifically RPL19A based on MLPCN hits PubChem Bioassay (2010)[AID] 
Target
Name:
60S ribosomal protein L19-A
Synonyms:
RL19A_YEAST RPL23A | YL14A
Type:
Enzyme Catalytic Domain
Mol. Mass.:
21739.62
Organism:
Saccharomyces cerevisiae
Description:
gi_536029
Residue:
189
  
Inhibitor
Name:
BDBM65992
Synonyms:
(E)-3-(1-methyl-3-indolyl)-2-nitro-2-propenoic acid ethyl ester 3-(1-Methyl-1H-indol-3-yl)-2-nitro-acrylic acid ethyl ester SMR000174261 ethyl (E)-3-(1-methylindol-3-yl)-2-nitro-prop-2-enoate | ethyl (E)-3-(1-methylindol-3-yl)-2-nitroprop-2-enoate
Type:
Small organic molecule
Emp. Form.:
C14H14N2O4
Mol. Mass.:
274.272
SMILES:
CCOC(=O)C(=C/c1cn(C)c2ccccc12)\[N+]([O-])=O
: