Target
General amino acid permease AGP1
Ligand
BDBM31063
Substrate
Meas. Tech.
Dose Response of TOR pathway GFP-fusion proteins in Saccharomyes cerevisiae specifically AGP1 based on MLPCN hits
EC50
653±n/a nM
Citation
 PubChem, PC Dose Response of TOR pathway GFP-fusion proteins in Saccharomyes cerevisiae specifically AGP1 based on MLPCN hits PubChem Bioassay (2010)[AID] 
Target
Name:
General amino acid permease AGP1
Synonyms:
AGP1 Agp1p
Type:
Enzyme Catalytic Domain
Mol. Mass.:
69674.09
Organism:
Saccharomyces cerevisiae S288c
Description:
gi_85666113
Residue:
633
  
Inhibitor
Name:
BDBM31063
Synonyms:
2-(methylsulfonyl)-4-phenyl-6-(trifluoromethyl)pyrimidine 2-methylsulfonyl-4-phenyl-6-(trifluoromethyl)pyrimidine SMR000022588 | cid_3236803
Type:
Small organic molecule
Emp. Form.:
C12H9F3N2O2S
Mol. Mass.:
302.272
SMILES:
CS(=O)(=O)c1nc(cc(n1)C(F)(F)F)-c1ccccc1
: