Target
Bcl-2-like protein 11
Ligand
BDBM67003
Substrate
Meas. Tech.
Luminescence Cell-Based Dose Retest to Identify Inhibitors of A1 Apoptosis
EC50
>350000±n/a nM
Citation
 PubChem, PC Luminescence Cell-Based Dose Retest to Identify Inhibitors of A1 Apoptosis PubChem Bioassay (2010)[AID] 
Target
Name:
Bcl-2-like protein 11
Synonyms:
B2L11_HUMAN BCL2L11 | BIM
Type:
PROTEIN
Mol. Mass.:
22175.26
Organism:
Homo sapiens (Human)
Description:
EBI_101325
Residue:
198
  
Inhibitor
Name:
BDBM67003
Synonyms:
KE-KI SMR000127334 | cid_25163034
Type:
Small organic molecule
Emp. Form.:
C43H72ClN16O7
Mol. Mass.:
960.587
SMILES:
[Cl-].CCCCc1cn(nn1)[C@@H](CCCC[NH3+])C(=O)N1CCN(CC1)c1nc(NCCOCCOCCOCC#C)nc(n1)N1CCN(CC1)C(=O)[C@H](CCCC[NH3+])n1cc(CCC(O)=O)nn1
: