Target
Apelin receptor
Ligand
BDBM32307
Substrate
Meas. Tech.
Dose Response confirmation of uHTS hits from a small molecule antagonists of the APJ receptor via a luminescent beta-arrestin assay
IC50
4670±n/a nM
Citation
 PubChem, PC Dose Response confirmation of uHTS hits from a small molecule antagonists of the APJ receptor via a luminescent beta-arrestin assay PubChem Bioassay (2010)[AID] 
Target
Name:
Apelin receptor
Synonyms:
AGTRL1 APJ_HUMAN Angiotensin receptor-like 1 Apelin receptor (APJ) G-protein coupled receptor HG11
Type:
Enzyme Catalytic Domain
Mol. Mass.:
42664.06
Organism:
Homo sapiens (Human)
Description:
P35414
Residue:
380
  
Inhibitor
Name:
BDBM32307
Synonyms:
4-chloro-3-nitro-benzoic acid [4-keto-6-[[(4-methylpyrimidin-2-yl)thio]methyl]pyran-3-yl] ester MLS000696790 [6-[(4-methylpyrimidin-2-yl)sulfanylmethyl]-4-oxidanylidene-pyran-3-yl] 4-chloranyl-3-nitro-benzoate cid_12005992
Type:
Small organic molecule
Emp. Form.:
C18H12ClN3O6S
Mol. Mass.:
433.822
SMILES:
Cc1ccnc(SCc2cc(=O)c(OC(=O)c3ccc(Cl)c(c3)[N+]([O-])=O)co2)n1
: