Target
NADPH oxidase 1
Ligand
BDBM67524
Substrate
Meas. Tech.
Late-stage luminescence-based cell-based dose response assay to identify inhibitors of NADPH oxidase 1 (NOX1): Purchased analogs
IC50
>17000±n/a nM
Citation
 PubChem, PC Late-stage luminescence-based cell-based dose response assay to identify inhibitors of NADPH oxidase 1 (NOX1): Purchased analogs PubChem Bioassay (2010)[AID] 
Target
Name:
NADPH oxidase 1
Synonyms:
MOX-1 Mitogenic oxidase 1 NOH-1 NOX-1 NOX1_HUMAN
Type:
PROTEIN
Mol. Mass.:
64890.44
Organism:
Homo sapiens (Human)
Description:
ChEMBL_792877
Residue:
564
  
Inhibitor
Name:
BDBM67524
Synonyms:
6-(4,5-diphenyl-1,3-dihydroimidazol-2-ylidene)-1-cyclohexa-2,4-dienone 6-(4,5-diphenyl-4-imidazolin-2-ylidene)cyclohexa-2,4-dien-1-one cid_5358179
Type:
Small organic molecule
Emp. Form.:
C21H16N2O
Mol. Mass.:
312.3645
SMILES:
Oc1ccccc1-c1nc(c([nH]1)-c1ccccc1)-c1ccccc1
: