Target
ATP-dependent molecular chaperone HSP82
Ligand
BDBM68255
Substrate
Meas. Tech.
Malachite Green Assay
IC50
3.2e+3±n/a nM
Citation
 Proisy, NSharp, SYBoxall, KConnelly, SRoe, SMProdromou, CSlawin, AMPearl, LHWorkman, PMoody, CJ Inhibition of Hsp90 with synthetic macrolactones: synthesis and structural and biological evaluation of ring and conformational analogs of radicicol. Chem Biol 13:1203-15 (2006)  
Target
Name:
ATP-dependent molecular chaperone HSP82
Synonyms:
82 kDa heat shock protein HSP82 HSP90 Heat shock protein Hsp90 heat-inducible isoform
Type:
Molecular Chaperone
Mol. Mass.:
81369.08
Organism:
Saccharomyces cerevisiae
Description:
Histidine-tagged yeast HSP90 was transformed into E. coli and purified (>90%) by metal affinity, gel filtration, and ion-exchange chromatography.
Residue:
709
  
Inhibitor
Name:
BDBM68255
Synonyms:
Microlactone, 14c
Type:
Small organic molecule
Emp. Form.:
C18H22O5
Mol. Mass.:
318.3643
SMILES:
C[C@@H]1C\C=C\CCCCC(=O)Cc2cc(O)cc(O)c2C(=O)O1
: