Target
Serine/threonine-protein phosphatase
Ligand
BDBM64574
Substrate
Meas. Tech.
Fluorescence Cell-Based Secondary Assay to Identify Inhibitors of Calcineurin
EC50
4663±n/a nM
Citation
 PubChem, PC Fluorescence Cell-Based Secondary Assay to Identify Inhibitors of Calcineurin PubChem Bioassay (2010)[AID] 
Target
Name:
Serine/threonine-protein phosphatase
Synonyms:
calcineurin A1, putative serine/threonine-protein phosphatase 2B catalytic subunit A1, putative
Type:
Enzyme Catalytic Domain
Mol. Mass.:
69558.03
Organism:
Candida dubliniensis CD36
Description:
gi_223640082
Residue:
607
  
Inhibitor
Name:
BDBM64574
Synonyms:
2,4-bis(chloranyl)-N-[5-(5,6,7,8-tetrahydronaphthalen-2-yl)-1,3,4-oxadiazol-2-yl]benzamide 2,4-dichloro-N-[5-(5,6,7,8-tetrahydronaphthalen-2-yl)-1,3,4-oxadiazol-2-yl]benzamide SMR000126874 | cid_4617025
Type:
Small organic molecule
Emp. Form.:
C19H15Cl2N3O2
Mol. Mass.:
388.247
SMILES:
Clc1ccc(C(=O)Nc2nnc(o2)-c2ccc3CCCCc3c2)c(Cl)c1
: