Target
Glycogen synthase kinase-3 beta
Ligand
BDBM68351
Substrate
Meas. Tech.
Luminescence Cell-Free Homogeneous Dose Retest to Identify Inhibitors of Glycogen Synthase Kinase-3 beta Activity
EC50
>100000±n/a nM
Citation
 PubChem, PC Luminescence Cell-Free Homogeneous Dose Retest to Identify Inhibitors of Glycogen Synthase Kinase-3 beta Activity PubChem Bioassay (2010)[AID] 
Target
Name:
Glycogen synthase kinase-3 beta
Synonyms:
GSK-3 beta GSK3B Glycogen synthase kinase 3 beta (GSK3B) Glycogen synthase kinase-3 beta (GSK-3B) Glycogen synthase kinase-3 beta (GSK3B) Glycogen synthase kinase-3beta (GSK3B) | Serine/threonine-protein kinase GSK3B
Type:
Enzyme
Mol. Mass.:
46756.38
Organism:
Homo sapiens (Human)
Description:
P49841
Residue:
420
  
Inhibitor
Name:
BDBM68351
Synonyms:
4,5-Dichloro-isothiazole-3-carboxylic acid 1-[(furan-2-ylmethyl)-carbamoyl]-ethyl ester 4,5-dichloroisothiazole-3-carboxylic acid [2-(2-furfurylamino)-2-keto-1-methyl-ethyl] ester SMR000006589 [1-(furan-2-ylmethylamino)-1-oxopropan-2-yl] 4,5-dichloro-1,2-thiazole-3-carboxylate | cid_647786
Type:
Small organic molecule
Emp. Form.:
C12H10Cl2N2O4S
Mol. Mass.:
349.19
SMILES:
CC(OC(=O)c1nsc(Cl)c1Cl)C(=O)NCc1ccco1
: