Target
Glycogen synthase kinase-3 beta
Ligand
BDBM68719
Substrate
Meas. Tech.
Luminescence Cell-Free Homogeneous Dose Retest to Identify Inhibitors of Glycogen Synthase Kinase-3 beta Activity
EC50
>300000±n/a nM
Citation
 PubChem, PC Luminescence Cell-Free Homogeneous Dose Retest to Identify Inhibitors of Glycogen Synthase Kinase-3 beta Activity PubChem Bioassay (2010)[AID] 
Target
Name:
Glycogen synthase kinase-3 beta
Synonyms:
GSK-3 beta GSK3B Glycogen synthase kinase 3 beta (GSK3B) Glycogen synthase kinase-3 beta (GSK-3B) Glycogen synthase kinase-3 beta (GSK3B) Glycogen synthase kinase-3beta (GSK3B) | Serine/threonine-protein kinase GSK3B
Type:
Enzyme
Mol. Mass.:
46756.38
Organism:
Homo sapiens (Human)
Description:
P49841
Residue:
420
  
Inhibitor
Name:
BDBM68719
Synonyms:
3-(4-methoxyphenyl)-5-[(4-methyl-5-phenyl-1,2,4-triazol-3-yl)sulfanylmethyl]-1,2,4-oxadiazole 3-(4-methoxyphenyl)-5-{[(4-methyl-5-phenyl-4H-1,2,4-triazol-3-yl)thio]methyl}-1,2,4-oxadiazole SMR000144565 | cid_1253767
Type:
Small organic molecule
Emp. Form.:
C19H17N5O2S
Mol. Mass.:
379.436
SMILES:
COc1ccc(cc1)-c1noc(CSc2nnc(-c3ccccc3)n2C)n1
: