Target
Glycogen synthase kinase-3 beta
Ligand
BDBM69120
Substrate
Meas. Tech.
Luminescence Cell-Free Homogeneous Dose Retest to Identify Inhibitors of Glycogen Synthase Kinase-3 beta Activity
EC50
>300000±n/a nM
Citation
 PubChem, PC Luminescence Cell-Free Homogeneous Dose Retest to Identify Inhibitors of Glycogen Synthase Kinase-3 beta Activity PubChem Bioassay (2010)[AID] 
Target
Name:
Glycogen synthase kinase-3 beta
Synonyms:
GSK-3 beta GSK3B Glycogen synthase kinase 3 beta (GSK3B) Glycogen synthase kinase-3 beta (GSK-3B) Glycogen synthase kinase-3 beta (GSK3B) Glycogen synthase kinase-3beta (GSK3B) | Serine/threonine-protein kinase GSK3B
Type:
Enzyme
Mol. Mass.:
46756.38
Organism:
Homo sapiens (Human)
Description:
P49841
Residue:
420
  
Inhibitor
Name:
BDBM69120
Synonyms:
1-(3-morpholin-4-ylprop-1-ynyl)cyclohexan-1-ol 1-(3-morpholinoprop-1-ynyl)cyclohexanol MLS000722814 cid_784919
Type:
Small organic molecule
Emp. Form.:
C13H21NO2
Mol. Mass.:
223.3113
SMILES:
OC1(CCCCC1)C#CCN1CCOCC1
: