Target
Glycogen synthase kinase-3 beta
Ligand
BDBM69225
Substrate
Meas. Tech.
Luminescence Cell-Free Homogeneous Dose Retest to Identify Inhibitors of Glycogen Synthase Kinase-3 beta Activity
EC50
>300000±n/a nM
Citation
 PubChem, PC Luminescence Cell-Free Homogeneous Dose Retest to Identify Inhibitors of Glycogen Synthase Kinase-3 beta Activity PubChem Bioassay (2010)[AID] 
Target
Name:
Glycogen synthase kinase-3 beta
Synonyms:
GSK-3 beta GSK3B Glycogen synthase kinase 3 beta (GSK3B) Glycogen synthase kinase-3 beta (GSK-3B) Glycogen synthase kinase-3 beta (GSK3B) Glycogen synthase kinase-3beta (GSK3B) | Serine/threonine-protein kinase GSK3B
Type:
Enzyme
Mol. Mass.:
46756.38
Organism:
Homo sapiens (Human)
Description:
P49841
Residue:
420
  
Inhibitor
Name:
BDBM69225
Synonyms:
2-chloroethyl N-[1-(1H-indol-3-yl)propan-2-yl]carbamate N-[1-(1H-indol-3-yl)propan-2-yl]carbamic acid 2-chloroethyl ester SMR000287203 | cid_2827474
Type:
Small organic molecule
Emp. Form.:
C14H17ClN2O2
Mol. Mass.:
280.75
SMILES:
CC(Cc1c[nH]c2ccccc12)NC(=O)OCCCl
: