Target
Glycogen synthase kinase-3 beta
Ligand
BDBM69530
Substrate
Meas. Tech.
Luminescence Cell-Free Homogeneous Dose Retest to Identify Inhibitors of Glycogen Synthase Kinase-3 beta Activity
EC50
171.3±n/a nM
Citation
 PubChem, PC Luminescence Cell-Free Homogeneous Dose Retest to Identify Inhibitors of Glycogen Synthase Kinase-3 beta Activity PubChem Bioassay (2010)[AID] 
Target
Name:
Glycogen synthase kinase-3 beta
Synonyms:
GSK-3 beta GSK3B Glycogen synthase kinase 3 beta (GSK3B) Glycogen synthase kinase-3 beta (GSK-3B) Glycogen synthase kinase-3 beta (GSK3B) Glycogen synthase kinase-3beta (GSK3B) | Serine/threonine-protein kinase GSK3B
Type:
Enzyme
Mol. Mass.:
46756.38
Organism:
Homo sapiens (Human)
Description:
P49841
Residue:
420
  
Inhibitor
Name:
BDBM69530
Synonyms:
(4-Amino-2-phenylamino-thiazol-5-yl)-phenyl-methanone (4-amino-2-anilino-5-thiazolyl)-phenylmethanone (4-azanyl-2-phenylazanyl-1,3-thiazol-5-yl)-phenyl-methanone SMR000429508 | cid_936046
Type:
Small organic molecule
Emp. Form.:
C16H13N3OS
Mol. Mass.:
295.359
SMILES:
Nc1nc(Nc2ccccc2)sc1C(=O)c1ccccc1
: