Target
Glycogen synthase kinase-3 beta
Ligand
BDBM69777
Substrate
Meas. Tech.
Luminescence Cell-Free Homogeneous Dose Retest to Identify Inhibitors of Glycogen Synthase Kinase-3 beta Activity
EC50
>300000±n/a nM
Citation
 PubChem, PC Luminescence Cell-Free Homogeneous Dose Retest to Identify Inhibitors of Glycogen Synthase Kinase-3 beta Activity PubChem Bioassay (2010)[AID] 
Target
Name:
Glycogen synthase kinase-3 beta
Synonyms:
GSK-3 beta GSK3B Glycogen synthase kinase 3 beta (GSK3B) Glycogen synthase kinase-3 beta (GSK-3B) Glycogen synthase kinase-3 beta (GSK3B) Glycogen synthase kinase-3beta (GSK3B) | Serine/threonine-protein kinase GSK3B
Type:
Enzyme
Mol. Mass.:
46756.38
Organism:
Homo sapiens (Human)
Description:
P49841
Residue:
420
  
Inhibitor
Name:
BDBM69777
Synonyms:
1,5-dimethyl-2,4-bis(oxidanylidene)-3-(phenylmethyl)thieno[2,3-d]pyrimidine-6-carboxylic acid 3-benzyl-1,5-dimethyl-2,4-dioxothieno[2,3-d]pyrimidine-6-carboxylic acid MLS001215902 cid_8073077
Type:
Small organic molecule
Emp. Form.:
C16H14N2O4S
Mol. Mass.:
330.358
SMILES:
Cc1c(sc2n(C)c(=O)n(Cc3ccccc3)c(=O)c12)C(O)=O
: