Target
Glycogen synthase kinase-3 beta
Ligand
BDBM70091
Substrate
Meas. Tech.
Luminescence Cell-Free Homogeneous Dose Retest to Identify Inhibitors of Glycogen Synthase Kinase-3 beta Activity
EC50
711.6±n/a nM
Citation
 PubChem, PC Luminescence Cell-Free Homogeneous Dose Retest to Identify Inhibitors of Glycogen Synthase Kinase-3 beta Activity PubChem Bioassay (2010)[AID] 
Target
Name:
Glycogen synthase kinase-3 beta
Synonyms:
GSK-3 beta GSK3B Glycogen synthase kinase 3 beta (GSK3B) Glycogen synthase kinase-3 beta (GSK-3B) Glycogen synthase kinase-3 beta (GSK3B) Glycogen synthase kinase-3beta (GSK3B) | Serine/threonine-protein kinase GSK3B
Type:
Enzyme
Mol. Mass.:
46756.38
Organism:
Homo sapiens (Human)
Description:
P49841
Residue:
420
  
Inhibitor
Name:
BDBM70091
Synonyms:
1-(4-amino-1,2,5-oxadiazol-3-yl)-5-[[cyclohexyl(methyl)amino]methyl]-N-[(3-hydroxyphenyl)methylideneamino]-4-triazolecarboxamide 1-(4-aminofurazan-3-yl)-5-[[cyclohexyl(methyl)amino]methyl]-N-[(3-hydroxybenzylidene)amino]triazole-4-carboxamide MLS001142859 cid_2068033
Type:
Small organic molecule
Emp. Form.:
C20H25N9O3
Mol. Mass.:
439.471
SMILES:
CN(Cc1c(nnn1-c1nonc1N)C(=O)NN=Cc1cccc(O)c1)C1CCCCC1
: