Target
Amyloid-beta A4 precursor protein-binding family A member 1
Ligand
BDBM50620
Substrate
Meas. Tech.
SAR analysis of small molecule inhibitors of Mint-PDZ and N-type Ca2+ channel carboxyl-terminal peptide association using HTRF - Set 2
IC50
3260±n/a nM
Citation
 PubChem, PC SAR analysis of small molecule inhibitors of Mint-PDZ and N-type Ca2+ channel carboxyl-terminal peptide association using HTRF - Set 2 PubChem Bioassay (2010)[AID] 
Target
Name:
Amyloid-beta A4 precursor protein-binding family A member 1
Synonyms:
APBA1_RAT Mint1 neuronal munc18-1 binding protein
Type:
Enzyme Catalytic Domain
Mol. Mass.:
92603.32
Organism:
Rattus norvegicus
Description:
gi_2625023
Residue:
839
  
Inhibitor
Name:
BDBM50620
Synonyms:
2-(2-furanyl)-4-quinolinecarboxylic acid [2-[(1,1-dioxo-3-thiolanyl)-methylamino]-2-oxoethyl] ester MLS000772718 [2-[(1,1-dioxothiolan-3-yl)-methylamino]-2-oxoethyl] 2-(furan-2-yl)quinoline-4-carboxylate cid_4008175
Type:
Small organic molecule
Emp. Form.:
C21H20N2O6S
Mol. Mass.:
428.458
SMILES:
CN(C1CCS(=O)(=O)C1)C(=O)COC(=O)c1cc(nc2ccccc12)-c1ccco1
: